{"text_format":"1","workbook":"xlsx","n_sheets":7,"sheets":["Budget-Year 1","Budget-Year 2","Budget-Year 3","Budget-Year 4","Budget-Year 5","Cumulative Budget","Indirect & Fringe Rates"],"not_rendered":{"charts":0,"images":0,"macros":1,"external_links":0,"defined_names":2,"comments":7,"pivot_tables":0},"unopened":[],"bounds":{"document_bytes":16777216,"sheet_cells":100000,"rows_first":2000,"rows_last":500,"rows_between":2000,"halvings":0,"cell_chars":16384,"cell_head_chars":4096},"cells_cut":0,"cells_raw":0,"read":"whole","date_system":"1900"}

{"sheet":"Budget-Year 1","index":0,"n_rows":116,"n_cols":17,"rows_kept":116,"cut":false,"hidden":false,"merged":[[83,2,83,4],[85,2,85,4],[86,2,86,4],[84,2,84,4],[81,1,81,4],[80,1,80,4],[63,1,63,5],[64,1,64,4],[65,1,65,4],[66,1,66,4],[67,1,67,4],[76,2,76,4],[68,1,68,4],[75,1,75,4],[78,1,78,4],[79,1,79,4],[44,0,44,4],[46,1,46,4],[47,1,47,4],[48,1,48,4],[50,1,50,4],[88,0,88,4],[89,0,89,5],[90,0,90,4],[92,0,92,5],[93,1,93,5],[87,2,87,4],[45,1,45,5],[49,1,49,5],[51,1,51,4],[52,1,52,4],[55,0,55,1],[60,0,60,4],[61,0,61,5],[62,0,62,4],[71,1,71,4],[72,1,72,4],[73,1,73,4],[74,1,74,4],[82,1,82,4],[70,1,70,5],[77,1,77,5],[33,0,33,4],[6,1,7,1],[4,0,4,5],[6,3,6,4],[6,5,7,5],[6,2,7,2],[5,0,5,5],[19,0,19,5],[6,0,7,0],[20,3,30,4],[3,2,3,5],[1,0,1,1],[3,0,3,1],[18,0,18,4],[32,0,32,5],[31,0,31,4],[0,0,0,5],[1,2,1,5],[111,0,111,5],[2,0,2,1],[2,2,2,5],[96,1,96,5],[97,3,97,4],[101,0,101,5],[93,0,100,0],[102,0,102,4],[35,0,35,5],[43,0,43,5],[53,0,53,4],[54,0,54,5],[34,0,34,5],[69,2,69,4],[112,0,112,4],[113,0,113,4],[114,0,114,5],[115,0,115,4],[91,0,91,5],[103,0,103,5],[104,0,104,5],[100,3,100,4],[95,1,95,5],[94,1,94,5],[42,0,42,4],[41,1,41,2],[36,1,36,2],[37,1,37,2],[38,1,38,2],[39,1,39,2],[40,1,40,2]]}
["Proposal Budget: Year 1"]
["Fiscal Year:"]
["Project Title:"]
["Principal Investigator(s):"]
[]
["A. Personnel"]
[null,"Name(s)","Staff Type","Number Person Months",null,"Funds Requested"]
[null,null,null,"Academic Year","Summer",null,"F&AS","CS","LTE","P,T,RA","RA,I","AH,UA","SE"]
{"$rows_left_out":109}
{"sheet":"Budget-Year 2","index":1,"n_rows":116,"n_cols":17,"rows_kept":116,"cut":false,"hidden":false,"merged":[[113,0,113,4],[114,0,114,5],[115,0,115,4],[101,0,101,5],[102,0,102,4],[103,0,103,5],[104,0,104,5],[111,0,111,5],[112,0,112,4],[90,0,90,4],[91,0,91,5],[92,0,92,5],[93,0,100,0],[93,1,93,5],[94,1,94,5],[95,1,95,5],[96,1,96,5],[97,3,97,4],[100,3,100,4],[89,0,89,5],[74,1,74,4],[75,1,75,4],[76,2,76,4],[77,1,77,5],[78,1,78,4],[79,1,79,4],[80,1,80,4],[81,1,81,4],[82,1,82,4],[87,2,87,4],[88,0,88,4],[83,2,83,4],[84,2,84,4],[85,2,85,4],[86,2,86,4],[73,1,73,4],[62,0,62,4],[63,1,63,5],[64,1,64,4],[65,1,65,4],[66,1,66,4],[67,1,67,4],[68,1,68,4],[69,2,69,4],[70,1,70,5],[71,1,71,4],[72,1,72,4],[61,0,61,5],[46,1,46,4],[47,1,47,4],[48,1,48,4],[49,1,49,5],[50,1,50,4],[51,1,51,4],[52,1,52,4],[53,0,53,4],[54,0,54,5],[55,0,55,1],[60,0,60,4],[45,1,45,5],[34,0,34,5],[35,0,35,5],[36,1,36,2],[37,1,37,2],[38,1,38,2],[39,1,39,2],[40,1,40,2],[41,1,41,2],[42,0,42,4],[43,0,43,5],[44,0,44,4],[33,0,33,4],[4,0,4,5],[5,0,5,5],[6,0,7,0],[6,1,7,1],[6,2,7,2],[6,3,6,4],[6,5,7,5],[18,0,18,4],[19,0,19,5],[20,3,30,4],[31,0,31,4],[32,0,32,5],[3,0,3,1],[3,2,3,5],[0,0,0,5],[1,0,1,1],[1,2,1,5],[2,0,2,1],[2,2,2,5]]}
["Proposal Budget: Year 2"]
["Fiscal Year:"]
["Project Title:",null,{"$f":"'Budget-Year 1'!C3:F3","v":0}]
["Principal Investigator(s):",null,{"$f":"'Budget-Year 1'!C4:F4","v":0}]
[]
["A. Personnel"]
[null,"Name(s)","Staff Type","Number Person Months",null,"Funds Requested"]
[null,null,null,"Academic Year","Summer",null,"F&AS","CS","LTE","P,T,RA","RA,I","AH,UA","SE"]
{"$rows_left_out":109}
{"sheet":"Budget-Year 3","index":2,"n_rows":116,"n_cols":17,"rows_kept":116,"cut":false,"hidden":false,"merged":[[3,0,3,1],[3,2,3,5],[0,0,0,5],[1,0,1,1],[1,2,1,5],[2,0,2,1],[2,2,2,5],[33,0,33,4],[4,0,4,5],[5,0,5,5],[6,0,7,0],[6,1,7,1],[6,2,7,2],[6,3,6,4],[6,5,7,5],[18,0,18,4],[19,0,19,5],[20,3,30,4],[31,0,31,4],[32,0,32,5],[45,1,45,5],[34,0,34,5],[35,0,35,5],[36,1,36,2],[37,1,37,2],[38,1,38,2],[39,1,39,2],[40,1,40,2],[41,1,41,2],[42,0,42,4],[43,0,43,5],[44,0,44,4],[61,0,61,5],[46,1,46,4],[47,1,47,4],[48,1,48,4],[49,1,49,5],[50,1,50,4],[51,1,51,4],[52,1,52,4],[53,0,53,4],[54,0,54,5],[55,0,55,1],[60,0,60,4],[73,1,73,4],[62,0,62,4],[63,1,63,5],[64,1,64,4],[65,1,65,4],[66,1,66,4],[67,1,67,4],[68,1,68,4],[69,2,69,4],[70,1,70,5],[71,1,71,4],[72,1,72,4],[89,0,89,5],[74,1,74,4],[75,1,75,4],[76,2,76,4],[77,1,77,5],[78,1,78,4],[79,1,79,4],[80,1,80,4],[81,1,81,4],[82,1,82,4],[87,2,87,4],[88,0,88,4],[83,2,83,4],[84,2,84,4],[85,2,85,4],[86,2,86,4],[90,0,90,4],[91,0,91,5],[92,0,92,5],[93,0,100,0],[93,1,93,5],[94,1,94,5],[95,1,95,5],[96,1,96,5],[97,3,97,4],[100,3,100,4],[113,0,113,4],[114,0,114,5],[115,0,115,4],[101,0,101,5],[102,0,102,4],[103,0,103,5],[104,0,104,5],[111,0,111,5],[112,0,112,4]]}
["Proposal Budget: Year 3"]
["Fiscal Year:"]
["Project Title:",null,{"$f":"'Budget-Year 1'!C3:F3","v":0}]
["Principal Investigator(s):",null,{"$f":"'Budget-Year 1'!C4:F4","v":0}]
[]
["A. Personnel"]
[null,"Name(s)","Staff Type","Number Person Months",null,"Funds Requested"]
[null,null,null,"Academic Year","Summer",null,"F&AS","CS","LTE","P,T,RA","RA,I","AH,UA","SE"]
{"$rows_left_out":109}
{"sheet":"Budget-Year 4","index":3,"n_rows":116,"n_cols":17,"rows_kept":116,"cut":false,"hidden":false,"merged":[[3,0,3,1],[3,2,3,5],[0,0,0,5],[1,0,1,1],[1,2,1,5],[2,0,2,1],[2,2,2,5],[33,0,33,4],[4,0,4,5],[5,0,5,5],[6,0,7,0],[6,1,7,1],[6,2,7,2],[6,3,6,4],[6,5,7,5],[18,0,18,4],[19,0,19,5],[20,3,30,4],[31,0,31,4],[32,0,32,5],[45,1,45,5],[34,0,34,5],[35,0,35,5],[36,1,36,2],[37,1,37,2],[38,1,38,2],[39,1,39,2],[40,1,40,2],[41,1,41,2],[42,0,42,4],[43,0,43,5],[44,0,44,4],[61,0,61,5],[46,1,46,4],[47,1,47,4],[48,1,48,4],[49,1,49,5],[50,1,50,4],[51,1,51,4],[52,1,52,4],[53,0,53,4],[54,0,54,5],[55,0,55,1],[60,0,60,4],[73,1,73,4],[62,0,62,4],[63,1,63,5],[64,1,64,4],[65,1,65,4],[66,1,66,4],[67,1,67,4],[68,1,68,4],[69,2,69,4],[70,1,70,5],[71,1,71,4],[72,1,72,4],[89,0,89,5],[74,1,74,4],[75,1,75,4],[76,2,76,4],[77,1,77,5],[78,1,78,4],[79,1,79,4],[80,1,80,4],[81,1,81,4],[82,1,82,4],[87,2,87,4],[88,0,88,4],[83,2,83,4],[84,2,84,4],[85,2,85,4],[86,2,86,4],[90,0,90,4],[91,0,91,5],[92,0,92,5],[93,0,100,0],[93,1,93,5],[94,1,94,5],[95,1,95,5],[96,1,96,5],[97,3,97,4],[100,3,100,4],[113,0,113,4],[114,0,114,5],[115,0,115,4],[101,0,101,5],[102,0,102,4],[103,0,103,5],[104,0,104,5],[111,0,111,5],[112,0,112,4]]}
["Proposal Budget: Year 4"]
["Fiscal Year:"]
["Project Title:",null,{"$f":"'Budget-Year 1'!C3:F3","v":0}]
["Principal Investigator(s):",null,{"$f":"'Budget-Year 1'!C4:F4","v":0}]
[]
["A. Personnel"]
[null,"Name(s)","Staff Type","Number Person Months",null,"Funds Requested"]
[null,null,null,"Academic Year","Summer",null,"F&AS","CS","LTE","P,T,RA","RA,I","AH,UA","SE"]
{"$rows_left_out":109}
{"sheet":"Budget-Year 5","index":4,"n_rows":116,"n_cols":18,"rows_kept":116,"cut":false,"hidden":false,"merged":[[3,0,3,1],[3,2,3,5],[0,0,0,5],[1,0,1,1],[1,2,1,5],[2,0,2,1],[2,2,2,5],[33,0,33,4],[4,0,4,5],[5,0,5,5],[6,0,7,0],[6,1,7,1],[6,2,7,2],[6,3,6,4],[6,5,7,5],[18,0,18,4],[19,0,19,5],[20,3,30,4],[31,0,31,4],[32,0,32,5],[45,1,45,5],[34,0,34,5],[35,0,35,5],[36,1,36,2],[37,1,37,2],[38,1,38,2],[39,1,39,2],[40,1,40,2],[41,1,41,2],[42,0,42,4],[43,0,43,5],[44,0,44,4],[61,0,61,5],[46,1,46,4],[47,1,47,4],[48,1,48,4],[49,1,49,5],[50,1,50,4],[51,1,51,4],[52,1,52,4],[53,0,53,4],[54,0,54,5],[55,0,55,1],[60,0,60,4],[73,1,73,4],[62,0,62,4],[63,1,63,5],[64,1,64,4],[65,1,65,4],[66,1,66,4],[67,1,67,4],[68,1,68,4],[69,2,69,4],[70,1,70,5],[71,1,71,4],[72,1,72,4],[89,0,89,5],[74,1,74,4],[75,1,75,4],[76,2,76,4],[77,1,77,5],[78,1,78,4],[79,1,79,4],[80,1,80,4],[81,1,81,4],[82,1,82,4],[87,2,87,4],[88,0,88,4],[83,2,83,4],[84,2,84,4],[85,2,85,4],[86,2,86,4],[90,0,90,4],[91,0,91,5],[92,0,92,5],[93,0,100,0],[93,1,93,5],[94,1,94,5],[95,1,95,5],[96,1,96,5],[97,3,97,4],[100,3,100,4],[113,0,113,4],[114,0,114,5],[115,0,115,4],[101,0,101,5],[102,0,102,4],[103,0,103,5],[104,0,104,5],[111,0,111,5],[112,0,112,4]]}
["Proposal Budget: Year 5"]
["Fiscal Year:"]
["Project Title:",null,{"$f":"'Budget-Year 1'!C3:F3","v":0}]
["Principal Investigator(s):",null,{"$f":"'Budget-Year 1'!C4:F4","v":0}]
[]
["A. Personnel"]
[null,"Name(s)","Staff Type","Number Person Months",null,"Funds Requested"]
[null,null,null,"Academic Year","Summer",null,"F&AS","CS","LTE","P,T,RA","RA,I","AH,UA","SE"]
{"$rows_left_out":109}
{"sheet":"Cumulative Budget","index":5,"n_rows":94,"n_cols":17,"rows_kept":94,"cut":false,"hidden":false,"merged":[[91,0,91,4],[92,0,92,5],[93,0,93,4],[79,0,79,5],[80,0,80,4],[81,0,81,5],[82,0,82,5],[90,0,90,4],[83,0,89,5],[69,0,69,5],[70,0,70,5],[71,0,78,0],[75,3,75,4],[78,3,78,4],[71,1,74,5],[68,0,68,4],[54,0,54,5],[55,0,55,1],[55,2,65,4],[66,0,66,4],[67,0,67,5],[53,0,53,4],[42,0,42,5],[43,0,43,1],[41,0,41,4],[43,2,45,4],[48,2,52,4],[46,0,46,4],[47,0,47,5],[48,0,48,1],[32,0,32,4],[36,0,40,5],[35,0,35,4],[33,0,33,5],[34,0,34,5],[17,0,17,4],[18,0,18,5],[19,3,29,4],[30,0,30,4],[31,0,31,5],[3,0,3,5],[4,0,4,5],[5,0,6,0],[5,1,6,1],[5,2,6,2],[5,3,5,4],[5,5,6,5],[0,0,0,5],[1,2,1,5],[1,0,1,1],[2,0,2,1],[2,2,2,5]]}
["Project Budget: Cumulative"]
["Project Title:",null,{"$f":"'Budget-Year 1'!C3:F3","v":0}]
["Principal Investigator(s):",null,{"$f":"'Budget-Year 1'!C4:F4","v":0}]
[]
["A. Personnel"]
[null,"Name(s)","Staff Type","Number Person Months",null,"Funds Requested"]
[null,null,null,"Academic Year","Summer",null,"F&AS","CS","LTE","P,T,RA","RA,I","AH,UA","SE"]
["1.",{"$f":"'Budget-Year 1'!B9","v":0},{"$f":"'Budget-Year 1'!C9","v":0},{"$f":"SUM('Budget-Year 1'!D9,'Budget-Year 2'!D9,'Budget-Year 3'!D9,'Budget-Year 4'!D9,'Budget-Year 5'!D9)","v":0},{"$f":"SUM('Budget-Year 1'!E9,'Budget-Year 2'!E9,'Budget-Year 3'!E9,'Budget-Year 4'!E9,'Budget-Year 5'!E9)","v":0},{"$f":"SUM('Budget-Year 1'!F9,'Budget-Year 2'!F9,'Budget-Year 3'!F9,'Budget-Year 4'!F9,'Budget-Year 5'!F9)","v":0},{"$f":"IF(#REF!='Indirect & Fringe Rates'!#REF!,'Indirect & Fringe Rates'!#REF!,IF('Cumulative Budget'!#REF!='Indirect & Fringe Rates'!$A$14,'Indirect & Fringe Rates'!$I3,IF('Cumulative Budget'!#REF!='Indirect & Fringe Rates'!$A$15,'Indirect & Fringe Rates'!$J3,IF(#REF!='Indirect & Fringe Rates'!$A$16,'Indirect & Fringe Rates'!$K3,IF('Cumulative Budget'!#REF!='Indirect & Fringe Rates'!$A$17,'Indirect & Fringe Rates'!$L3,IF('Cumulative Budget'!#REF!='Indirect & Fringe Rates'!$A$18,'Indirect & Fringe Rates'!$M3,0))))))","v":{"$error":"#REF!"}},{"$f":"IF(#REF!='Indirect & Fringe Rates'!#REF!,'Indirect & Fringe Rates'!#REF!,IF('Cumulative Budget'!#REF!='Indirect & Fringe Rates'!$A$14,'Indirect & Fringe Rates'!$I4,IF('Cumulative Budget'!#REF!='Indirect & Fringe Rates'!$A$15,'Indirect & Fringe Rates'!$J4,IF(#REF!='Indirect & Fringe Rates'!$A$16,'Indirect & Fringe Rates'!$K4,IF('Cumulative Budget'!#REF!='Indirect & Fringe Rates'!$A$17,'Indirect & Fringe Rates'!$L4,IF('Cumulative Budget'!#REF!='Indirect & Fringe Rates'!$A$18,'Indirect & Fringe Rates'!$M4,0))))))","v":{"$error":"#REF!"}},{"$f":"IF(#REF!='Indirect & Fringe Rates'!#REF!,'Indirect & Fringe Rates'!#REF!,IF('Cumulative Budget'!#REF!='Indirect & Fringe Rates'!$A$14,'Indirect & Fringe Rates'!$I5,IF('Cumulative Budget'!#REF!='Indirect & Fringe Rates'!$A$15,'Indirect & Fringe Rates'!$J5,IF(#REF!='Indirect & Fringe Rates'!$A$16,'Indirect & Fringe Rates'!$K5,IF('Cumulative Budget'!#REF!='Indirect & Fringe Rates'!$A$17,'Indirect & Fringe Rates'!$L5,IF('Cumulative Budget'!#REF!='Indirect & Fringe Rates'!$A$18,'Indirect & Fringe Rates'!$M5,0))))))","v":{"$error":"#REF!"}},{"$f":"IF(#REF!='Indirect & Fringe Rates'!#REF!,'Indirect & Fringe Rates'!#REF!,IF('Cumulative Budget'!#REF!='Indirect & Fringe Rates'!$A$14,'Indirect & Fringe Rates'!$I6,IF('Cumulative Budget'!#REF!='Indirect & Fringe Rates'!$A$15,'Indirect & Fringe Rates'!$J6,IF(#REF!='Indirect & Fringe Rates'!$A$16,'Indirect & Fringe Rates'!$K6,IF('Cumulative Budget'!#REF!='Indirect & Fringe Rates'!$A$17,'Indirect & Fringe Rates'!$L6,IF('Cumulative Budget'!#REF!='Indirect & Fringe Rates'!$A$18,'Indirect & Fringe Rates'!$M6,0))))))","v":{"$error":"#REF!"}},{"$f":"IF(#REF!='Indirect & Fringe Rates'!#REF!,'Indirect & Fringe Rates'!#REF!,IF('Cumulative Budget'!#REF!='Indirect & Fringe Rates'!$A$14,'Indirect & Fringe Rates'!$I7,IF('Cumulative Budget'!#REF!='Indirect & Fringe Rates'!$A$15,'Indirect & Fringe Rates'!$J7,IF(#REF!='Indirect & Fringe Rates'!$A$16,'Indirect & Fringe Rates'!$K7,IF('Cumulative Budget'!#REF!='Indirect & Fringe Rates'!$A$17,'Indirect & Fringe Rates'!$L7,IF('Cumulative Budget'!#REF!='Indirect & Fringe Rates'!$A$18,'Indirect & Fringe Rates'!$M7,0))))))","v":{"$error":"#REF!"}},{"$f":"IF(#REF!='Indirect & Fringe Rates'!#REF!,'Indirect & Fringe Rates'!#REF!,IF('Cumulative Budget'!#REF!='Indirect & Fringe Rates'!$A$14,'Indirect & Fringe Rates'!$I8,IF('Cumulative Budget'!#REF!='Indirect & Fringe Rates'!$A$15,'Indirect & Fringe Rates'!$J8,IF(#REF!='Indirect & Fringe Rates'!$A$16,'Indirect & Fringe Rates'!$K8,IF('Cumulative Budget'!#REF!='Indirect & Fringe Rates'!$A$17,'Indirect & Fringe Rates'!$L8,IF('Cumulative Budget'!#REF!='Indirect & Fringe Rates'!$A$18,'Indirect & Fringe Rates'!$M8,0))))))","v":{"$error":"#REF!"}},{"$f":"IF(#REF!='Indirect & Fringe Rates'!#REF!,'Indirect & Fringe Rates'!#REF!,IF('Cumulative Budget'!#REF!='Indirect & Fringe Rates'!$A$14,'Indirect & Fringe Rates'!$I9,IF('Cumulative Budget'!#REF!='Indirect & Fringe Rates'!$A$15,'Indirect & Fringe Rates'!$J9,IF(#REF!='Indirect & Fringe Rates'!$A$16,'Indirect & Fringe Rates'!$K9,IF('Cumulative Budget'!#REF!='Indirect & Fringe Rates'!$A$17,'Indirect & Fringe Rates'!$L9,IF('Cumulative Budget'!#REF!='Indirect & Fringe Rates'!$A$18,'Indirect & Fringe Rates'!$M9,0))))))","v":{"$error":"#REF!"}}]
{"$rows_left_out":87}
{"sheet":"Indirect & Fringe Rates","index":6,"n_rows":24,"n_cols":13,"rows_kept":24,"cut":false,"hidden":false,"merged":[[0,7,0,12],[1,0,1,5],[5,0,5,5],[0,0,0,5]]}
["Indirect Cost Rates",null,null,null,null,null,null,"Fringe Benefits Rates"]
["Federal",null,null,null,null,null,null,"Personnel Type","FY 19-20","FY 20-21","FY 21-22","FY 22-23","FY 23-24"]
[null,"FY 19-20","FY 20-21","FY 21-22","FY 22-23","FY 23-24",null,"Unclassified (Faculty & Academic Staff)",0.38,{"$f":"I3*1.05","v":0.39900000000000002},0.41895000000000004,0.43989750000000005,0.46189237500000008]
["On-campus",0.36,0.36,0.36,0.36,0.36,null,"University Staff",0.56000000000000005,0.58800000000000008,0.61740000000000006,0.64827000000000012,0.68068350000000011]
["Off-campus",0.12,0.11,0.11,0.11,0.11,null,"Limited Term Employee (LTE)",0.25,{"$f":"I5*1.05","v":0.26250000000000001},{"$f":"J5*1.05","v":0.27562500000000001},{"$f":"K5*1.05","v":0.28940625000000003},{"$f":"L5*1.05","v":0.30387656250000006}]
["Non-Federal",null,null,null,null,null,null,"Graduate Assistant",0.13500000000000001,0.14175000000000001,0.14883750000000001,0.15627937500000003,0.16409334375000004]
["<$5,000",0.1,0.1,0.1,0.1,0.1,null,"Research Associate",0.26,0.27300000000000002,0.28665000000000002,0.30098250000000004,0.31603162500000004]
["$5,001-$20,000",0.15,0.15,0.15,0.15,0.15,null,"Ad Hoc",0.16,0.16800000000000001,0.17640000000000003,0.18522000000000005,0.19448100000000007]
{"$rows_left_out":16}